Target
Mitogen-activated protein kinase kinase kinase kinase 2
Ligand
BDBM51819
Substrate
Meas. Tech.
Dose Response Confirmation Screen via Multiplex HTS Assay for Inhibitors of MEK Kinase PB1 Domains, specifically MEK5 binding to MEK Kinase 2 Mutant
EC50
30000±n/a nM
Citation
 PubChem, PC Dose Response Confirmation Screen via Multiplex HTS Assay for Inhibitors of MEK Kinase PB1 Domains, specifically MEK5 binding to MEK Kinase 2 Mutant PubChem Bioassay (2009)[AID] 
Target
Name:
Mitogen-activated protein kinase kinase kinase kinase 2
Synonyms:
2.7.11.1 GC kinase Germinal center kinase MAP4K2 MEK kinase kinase 2 RAB8IP | Rab8-interacting protein
Type:
Mol. Mass.:
91551.35
Organism:
Homo sapiens (Human)
Description:
Residue:
820
  
Inhibitor
Name:
BDBM51819
Synonyms:
MLS000722074 N-[3-[[4-(2-hydroxyethyl)piperazin-1-yl]-pyridin-2-yl-methyl]-4,5-dimethyl-thiophen-2-yl]benzamide N-[3-[[4-(2-hydroxyethyl)piperazino]-(2-pyridyl)methyl]-4,5-dimethyl-2-thienyl]benzamide cid_5097704
Type:
Small organic molecule
Emp. Form.:
C25H30N4O2S
Mol. Mass.:
450.596
SMILES:
Cc1sc(NC(=O)c2ccccc2)c(C(N2CCN(CCO)CC2)c2ccccn2)c1C
: