Target
Mitogen-activated protein kinase kinase kinase kinase 2
Ligand
BDBM34829
Substrate
Meas. Tech.
Dose Response Confirmation Screen via Multiplex HTS Assay for Inhibitors of MEK Kinase PB1 Domains, specifically MEK5 binding to MEK Kinase 2 Mutant
EC50
30000±n/a nM
Citation
 PubChem, PC Dose Response Confirmation Screen via Multiplex HTS Assay for Inhibitors of MEK Kinase PB1 Domains, specifically MEK5 binding to MEK Kinase 2 Mutant PubChem Bioassay (2009)[AID] 
Target
Name:
Mitogen-activated protein kinase kinase kinase kinase 2
Synonyms:
2.7.11.1 GC kinase Germinal center kinase MAP4K2 MEK kinase kinase 2 RAB8IP | Rab8-interacting protein
Type:
Mol. Mass.:
91551.35
Organism:
Homo sapiens (Human)
Description:
Residue:
820
  
Inhibitor
Name:
BDBM34829
Synonyms:
3-hydroxy-N'-{3-methoxy-4-[2-(1-piperidinyl)ethoxy]benzylidene}-2-naphthohydrazide 3-hydroxy-N-[[3-methoxy-4-(2-piperidinoethoxy)benzylidene]amino]-2-naphthamide MLS000704281 SMR000231265 | cid_1000034
Type:
Small organic molecule
Emp. Form.:
C26H29N3O4
Mol. Mass.:
447.5262
SMILES:
COc1cc(C=NNC(=O)c2cc3ccccc3cc2O)ccc1OCCN1CCCCC1
: