Target
Mitogen-activated protein kinase kinase kinase kinase 2
Ligand
BDBM33176
Substrate
Meas. Tech.
Dose Response Confirmation Screen via Multiplex HTS Assay for Inhibitors of MEK Kinase PB1 Domains, specifically MEK5 binding to MEK Kinase 2 Mutant
EC50
30000±n/a nM
Citation
 PubChem, PC Dose Response Confirmation Screen via Multiplex HTS Assay for Inhibitors of MEK Kinase PB1 Domains, specifically MEK5 binding to MEK Kinase 2 Mutant PubChem Bioassay (2009)[AID] 
Target
Name:
Mitogen-activated protein kinase kinase kinase kinase 2
Synonyms:
2.7.11.1 GC kinase Germinal center kinase MAP4K2 MEK kinase kinase 2 RAB8IP | Rab8-interacting protein
Type:
Mol. Mass.:
91551.35
Organism:
Homo sapiens (Human)
Description:
Residue:
820
  
Inhibitor
Name:
BDBM33176
Synonyms:
(2E)-3-ethyl-2-[(1-ethyl-6-methyl-2-quinolin-1-iumyl)methylidene]-5,6-dimethyl-1,3-benzothiazole;iodide (2E)-3-ethyl-2-[(1-ethyl-6-methyl-quinolin-1-ium-2-yl)methylidene]-5,6-dimethyl-1,3-benzothiazole;iodide 1-Ethyl-2-(3-ethyl-5,6-dimethyl-3H-benzothiazol-2-ylidenemethyl)-6-methyl-quinol SMR000306528 | cid_16193034
Type:
Small organic molecule
Emp. Form.:
C24H27N2S
Mol. Mass.:
375.549
SMILES:
CCN1\C(Sc2cc(C)c(C)cc12)=C/c1ccc2cc(C)ccc2[n+]1CC
: