Target
Mitogen-activated protein kinase kinase kinase kinase 2
Ligand
BDBM50505
Substrate
Meas. Tech.
Dose Response Confirmation Screen via Multiplex HTS Assay for Inhibitors of MEK Kinase PB1 Domains, specifically MEK5 binding to MEK Kinase 2 Mutant
EC50
30000±n/a nM
Citation
 PubChem, PC Dose Response Confirmation Screen via Multiplex HTS Assay for Inhibitors of MEK Kinase PB1 Domains, specifically MEK5 binding to MEK Kinase 2 Mutant PubChem Bioassay (2009)[AID] 
Target
Name:
Mitogen-activated protein kinase kinase kinase kinase 2
Synonyms:
2.7.11.1 GC kinase Germinal center kinase MAP4K2 MEK kinase kinase 2 RAB8IP | Rab8-interacting protein
Type:
Mol. Mass.:
91551.35
Organism:
Homo sapiens (Human)
Description:
Residue:
820
  
Inhibitor
Name:
BDBM50505
Synonyms:
4-methyl-5-[2-(2-pyrimidinylamino)-4-thiazolyl]-2-thiazolamine MLS000706678 [4-(2-amino-4-methyl-thiazol-5-yl)thiazol-2-yl]-(2-pyrimidyl)amine | cid_2877714
Type:
Small organic molecule
Emp. Form.:
C11H10N6S2
Mol. Mass.:
290.367
SMILES:
Cc1nc(N)sc1-c1csc(Nc2ncccn2)n1
: