Target
Mitogen-activated protein kinase kinase kinase kinase 2
Ligand
BDBM51857
Substrate
Meas. Tech.
Dose Response Confirmation Screen via Multiplex HTS Assay for Inhibitors of MEK Kinase PB1 Domains, specifically MEK5 binding to MEK Kinase 2 Mutant
EC50
30000±n/a nM
Citation
 PubChem, PC Dose Response Confirmation Screen via Multiplex HTS Assay for Inhibitors of MEK Kinase PB1 Domains, specifically MEK5 binding to MEK Kinase 2 Mutant PubChem Bioassay (2009)[AID] 
Target
Name:
Mitogen-activated protein kinase kinase kinase kinase 2
Synonyms:
2.7.11.1 GC kinase Germinal center kinase MAP4K2 MEK kinase kinase 2 RAB8IP | Rab8-interacting protein
Type:
Mol. Mass.:
91551.35
Organism:
Homo sapiens (Human)
Description:
Residue:
820
  
Inhibitor
Name:
BDBM51857
Synonyms:
MLS001010894 N-[4-(3-bromophenyl)-1,3-thiazol-2-yl]-2-[3-[3-(dimethylamino)propyl]-4-oxoquinazolin-2-yl]sulfanylacetamide N-[4-(3-bromophenyl)thiazol-2-yl]-2-[[3-[3-(dimethylamino)propyl]-4-keto-quinazolin-2-yl]thio]acetamide cid_2080746
Type:
Small organic molecule
Emp. Form.:
C24H24BrN5O2S2
Mol. Mass.:
558.514
SMILES:
CN(C)CCCn1c(SCC(=O)Nc2nc(cs2)-c2cccc(Br)c2)nc2ccccc2c1=O
: