Target
Mitogen-activated protein kinase kinase kinase kinase 2
Ligand
BDBM51864
Substrate
Meas. Tech.
Dose Response Confirmation Screen via Multiplex HTS Assay for Inhibitors of MEK Kinase PB1 Domains, specifically MEK5 binding to MEK Kinase 2 Mutant
EC50
4100±n/a nM
Citation
 PubChem, PC Dose Response Confirmation Screen via Multiplex HTS Assay for Inhibitors of MEK Kinase PB1 Domains, specifically MEK5 binding to MEK Kinase 2 Mutant PubChem Bioassay (2009)[AID] 
Target
Name:
Mitogen-activated protein kinase kinase kinase kinase 2
Synonyms:
2.7.11.1 GC kinase Germinal center kinase MAP4K2 MEK kinase kinase 2 RAB8IP | Rab8-interacting protein
Type:
Mol. Mass.:
91551.35
Organism:
Homo sapiens (Human)
Description:
Residue:
820
  
Inhibitor
Name:
BDBM51864
Synonyms:
IW-IW SMR000391068 | cid_16196557
Type:
Small organic molecule
Emp. Form.:
C56H77ClN18O5
Mol. Mass.:
1117.781
SMILES:
Cl.CCC(C)C(N)c1cn(nn1)C(Cc1cc2ccccc2[nH]1)C(=O)N1CCN(CC1)c1nc(NCCOCCOCCOCC#C)nc(n1)N1CCN(CC1)C(=O)C(Cc1cc2ccccc2[nH]1)n1cc(nn1)C(N)C(C)CC
: