Target
Mitogen-activated protein kinase kinase kinase kinase 2
Ligand
BDBM50174412
Substrate
Meas. Tech.
Dose Response Confirmation Screen via Multiplex HTS Assay for Inhibitors of MEK Kinase PB1 Domains, specifically MEK5 binding to MEK Kinase 2 Mutant
EC50
30000±n/a nM
Citation
 PubChem, PC Dose Response Confirmation Screen via Multiplex HTS Assay for Inhibitors of MEK Kinase PB1 Domains, specifically MEK5 binding to MEK Kinase 2 Mutant PubChem Bioassay (2009)[AID] 
Target
Name:
Mitogen-activated protein kinase kinase kinase kinase 2
Synonyms:
2.7.11.1 GC kinase Germinal center kinase MAP4K2 MEK kinase kinase 2 RAB8IP | Rab8-interacting protein
Type:
Mol. Mass.:
91551.35
Organism:
Homo sapiens (Human)
Description:
Residue:
820
  
Inhibitor
Name:
BDBM50174412
Synonyms:
9-Methoxy-5,11-dimethyl-6H-pyrido[4,3-b]carbazole 9-methoxy ellipticine CHEMBL19954 cid_72512
Type:
Small organic molecule
Emp. Form.:
C18H16N2O
Mol. Mass.:
276.3324
SMILES:
COc1ccc2[nH]c3c(C)c4ccncc4c(C)c3c2c1
: