Target
Mitogen-activated protein kinase kinase kinase kinase 2
Ligand
BDBM51904
Substrate
Meas. Tech.
Dose Response Confirmation Screen via Multiplex HTS Assay for Inhibitors of MEK Kinase PB1 Domains, specifically MEK5 binding to MEK Kinase 2 Mutant
EC50
30000±n/a nM
Citation
 PubChem, PC Dose Response Confirmation Screen via Multiplex HTS Assay for Inhibitors of MEK Kinase PB1 Domains, specifically MEK5 binding to MEK Kinase 2 Mutant PubChem Bioassay (2009)[AID] 
Target
Name:
Mitogen-activated protein kinase kinase kinase kinase 2
Synonyms:
2.7.11.1 GC kinase Germinal center kinase MAP4K2 MEK kinase kinase 2 RAB8IP | Rab8-interacting protein
Type:
Mol. Mass.:
91551.35
Organism:
Homo sapiens (Human)
Description:
Residue:
820
  
Inhibitor
Name:
BDBM51904
Synonyms:
1-Decyloxycarbonylmethyl-2-(2-methoxy-phenoxymethyl)-3-methyl-3H-benzoimidazol-1-ium 2-[2-[(2-methoxyphenoxy)methyl]-3-methyl-benzimidazol-3-ium-1-yl]acetic acid decyl ester;chloride SMR000504924 decyl 2-[2-[(2-methoxyphenoxy)methyl]-3-methyl-benzimidazol-3-ium-1-yl]ethanoate;chloride | decyl 2-[2-[(2-methoxyphenoxy)methyl]-3-methylbenzimidazol-3-ium-1-yl]acetate;chloride
Type:
Small organic molecule
Emp. Form.:
C28H39N2O4
Mol. Mass.:
467.6197
SMILES:
CCCCCCCCCCOC(=O)Cn1c(COc2ccccc2OC)[n+](C)c2ccccc12
: