Target
Mitogen-activated protein kinase kinase kinase kinase 2
Ligand
BDBM51924
Substrate
Meas. Tech.
Dose Response Confirmation Screen via Multiplex HTS Assay for Inhibitors of MEK Kinase PB1 Domains, specifically MEK5 binding to MEK Kinase 2 Mutant
EC50
13770±n/a nM
Citation
 PubChem, PC Dose Response Confirmation Screen via Multiplex HTS Assay for Inhibitors of MEK Kinase PB1 Domains, specifically MEK5 binding to MEK Kinase 2 Mutant PubChem Bioassay (2009)[AID] 
Target
Name:
Mitogen-activated protein kinase kinase kinase kinase 2
Synonyms:
2.7.11.1 GC kinase Germinal center kinase MAP4K2 MEK kinase kinase 2 RAB8IP | Rab8-interacting protein
Type:
Mol. Mass.:
91551.35
Organism:
Homo sapiens (Human)
Description:
Residue:
820
  
Inhibitor
Name:
BDBM51924
Synonyms:
(4S)-1-benzyl-4-(3-fluorophenyl)-6-methyl-2-[[3-(trifluoromethyl)benzyl]amino]-4H-pyrimidine-5-carboxylic acid methyl ester MLS000829935 cid_24789249 methyl (4S)-4-(3-fluorophenyl)-6-methyl-1-(phenylmethyl)-2-[[3-(trifluoromethyl)phenyl]methylamino]-4H-pyrimidine-5-carboxylate
Type:
Small organic molecule
Emp. Form.:
C28H25F4N3O2
Mol. Mass.:
511.5106
SMILES:
COC(=O)C1=C(C)N(Cc2ccccc2)C(NCc2cccc(c2)C(F)(F)F)=N[C@H]1c1cccc(F)c1
: