Target
Mitogen-activated protein kinase kinase kinase kinase 2
Ligand
BDBM51797
Substrate
Meas. Tech.
Dose Response Confirmation via Multiplex HTS Assay for Inhibitors of MEK Kinase PB1 Domains, specifically MEK5 binding to MEK Kinase 2 Wildtype
EC50
30000±n/a nM
Citation
 PubChem, PC Dose Response Confirmation via Multiplex HTS Assay for Inhibitors of MEK Kinase PB1 Domains, specifically MEK5 binding to MEK Kinase 2 Wildtype PubChem Bioassay (2009)[AID] 
Target
Name:
Mitogen-activated protein kinase kinase kinase kinase 2
Synonyms:
2.7.11.1 GC kinase Germinal center kinase MAP4K2 MEK kinase kinase 2 RAB8IP | Rab8-interacting protein
Type:
Mol. Mass.:
91551.35
Organism:
Homo sapiens (Human)
Description:
Residue:
820
  
Inhibitor
Name:
BDBM51797
Synonyms:
MLS000527538 N-[1,3-diketo-2-(m-tolyl)isoindolin-4-yl]acetamide N-[2-(3-methylphenyl)-1,3-dioxo-4-isoindolyl]acetamide SMR000118012 | cid_830808
Type:
Small organic molecule
Emp. Form.:
C17H14N2O3
Mol. Mass.:
294.3047
SMILES:
CC(=O)Nc1cccc2C(=O)N(C(=O)c12)c1cccc(C)c1
: