Target
Mitogen-activated protein kinase kinase kinase kinase 2
Ligand
BDBM51812
Substrate
Meas. Tech.
Dose Response Confirmation via Multiplex HTS Assay for Inhibitors of MEK Kinase PB1 Domains, specifically MEK5 binding to MEK Kinase 2 Wildtype
EC50
30000±n/a nM
Citation
 PubChem, PC Dose Response Confirmation via Multiplex HTS Assay for Inhibitors of MEK Kinase PB1 Domains, specifically MEK5 binding to MEK Kinase 2 Wildtype PubChem Bioassay (2009)[AID] 
Target
Name:
Mitogen-activated protein kinase kinase kinase kinase 2
Synonyms:
2.7.11.1 GC kinase Germinal center kinase MAP4K2 MEK kinase kinase 2 RAB8IP | Rab8-interacting protein
Type:
Mol. Mass.:
91551.35
Organism:
Homo sapiens (Human)
Description:
Residue:
820
  
Inhibitor
Name:
BDBM51812
Synonyms:
MLS000559685 N-[4-(3-carbazol-9-yl-2-hydroxy-propoxy)phenyl]acetamide N-[4-(3-carbazol-9-yl-2-oxidanyl-propoxy)phenyl]ethanamide SMR000176389 | cid_3124282
Type:
Small organic molecule
Emp. Form.:
C23H22N2O3
Mol. Mass.:
374.4324
SMILES:
CC(=O)Nc1ccc(OCC(O)Cn2c3ccccc3c3ccccc23)cc1
: