Target
Mitogen-activated protein kinase kinase kinase kinase 2
Ligand
BDBM32329
Substrate
Meas. Tech.
Dose Response Confirmation via Multiplex HTS Assay for Inhibitors of MEK Kinase PB1 Domains, specifically MEK5 binding to MEK Kinase 2 Wildtype
EC50
530±n/a nM
Citation
 PubChem, PC Dose Response Confirmation via Multiplex HTS Assay for Inhibitors of MEK Kinase PB1 Domains, specifically MEK5 binding to MEK Kinase 2 Wildtype PubChem Bioassay (2009)[AID] 
Target
Name:
Mitogen-activated protein kinase kinase kinase kinase 2
Synonyms:
2.7.11.1 GC kinase Germinal center kinase MAP4K2 MEK kinase kinase 2 RAB8IP | Rab8-interacting protein
Type:
Mol. Mass.:
91551.35
Organism:
Homo sapiens (Human)
Description:
Residue:
820
  
Inhibitor
Name:
BDBM32329
Synonyms:
(2Z)-3-ethyl-2-[(E)-3-(3-ethyl-1,3-benzothiazol-3-ium-2-yl)-2-methyl-prop-2-enylidene]-1,3-benzothiazole;iodide Cyanines, 1 SMR000354813 | cid_6364517
Type:
Small organic molecule
Emp. Form.:
C22H23N2S2
Mol. Mass.:
379.561
SMILES:
CCN1\C(Sc2ccccc12)=C\C(\C)=C\c1sc2ccccc2[n+]1CC
: