Target
Mitogen-activated protein kinase kinase kinase kinase 2
Ligand
BDBM51865
Substrate
Meas. Tech.
Dose Response Confirmation via Multiplex HTS Assay for Inhibitors of MEK Kinase PB1 Domains, specifically MEK5 binding to MEK Kinase 2 Wildtype
EC50
30000±n/a nM
Citation
 PubChem, PC Dose Response Confirmation via Multiplex HTS Assay for Inhibitors of MEK Kinase PB1 Domains, specifically MEK5 binding to MEK Kinase 2 Wildtype PubChem Bioassay (2009)[AID] 
Target
Name:
Mitogen-activated protein kinase kinase kinase kinase 2
Synonyms:
2.7.11.1 GC kinase Germinal center kinase MAP4K2 MEK kinase kinase 2 RAB8IP | Rab8-interacting protein
Type:
Mol. Mass.:
91551.35
Organism:
Homo sapiens (Human)
Description:
Residue:
820
  
Inhibitor
Name:
BDBM51865
Synonyms:
3-(2-furanyl)-5-[(E)-2-(5-nitro-2-furanyl)ethenyl]-2-phenyl-3,4-dihydropyrazole 5-(2-furyl)-3-[(E)-2-(5-nitro-2-furyl)vinyl]-1-phenyl-2-pyrazoline SMR000385463 | cid_5750335
Type:
Small organic molecule
Emp. Form.:
C19H15N3O4
Mol. Mass.:
349.3401
SMILES:
[O-][N+](=O)c1ccc(C=C[C-]2CC(c3ccco3)[N+](=N2)c2ccccc2)o1
: