Target
Mitogen-activated protein kinase kinase kinase kinase 2
Ligand
BDBM38802
Substrate
Meas. Tech.
Dose Response Confirmation via Multiplex HTS Assay for Inhibitors of MEK Kinase PB1 Domains, specifically MEK5 binding to MEK Kinase 2 Wildtype
EC50
2820±n/a nM
Citation
 PubChem, PC Dose Response Confirmation via Multiplex HTS Assay for Inhibitors of MEK Kinase PB1 Domains, specifically MEK5 binding to MEK Kinase 2 Wildtype PubChem Bioassay (2009)[AID] 
Target
Name:
Mitogen-activated protein kinase kinase kinase kinase 2
Synonyms:
2.7.11.1 GC kinase Germinal center kinase MAP4K2 MEK kinase kinase 2 RAB8IP | Rab8-interacting protein
Type:
Mol. Mass.:
91551.35
Organism:
Homo sapiens (Human)
Description:
Residue:
820
  
Inhibitor
Name:
BDBM38802
Synonyms:
MLS000038842 cid_659226
Type:
Small organic molecule
Emp. Form.:
C21H16BrNO6
Mol. Mass.:
458.259
SMILES:
CCOC(=O)C(C(=O)OCC)c1cc(Br)c2noc3-c4ccccc4C(=O)c1c23
: