Target
Mitogen-activated protein kinase kinase kinase kinase 2
Ligand
BDBM51895
Substrate
Meas. Tech.
Dose Response Confirmation via Multiplex HTS Assay for Inhibitors of MEK Kinase PB1 Domains, specifically MEK5 binding to MEK Kinase 2 Wildtype
EC50
9570±n/a nM
Citation
 PubChem, PC Dose Response Confirmation via Multiplex HTS Assay for Inhibitors of MEK Kinase PB1 Domains, specifically MEK5 binding to MEK Kinase 2 Wildtype PubChem Bioassay (2009)[AID] 
Target
Name:
Mitogen-activated protein kinase kinase kinase kinase 2
Synonyms:
2.7.11.1 GC kinase Germinal center kinase MAP4K2 MEK kinase kinase 2 RAB8IP | Rab8-interacting protein
Type:
Mol. Mass.:
91551.35
Organism:
Homo sapiens (Human)
Description:
Residue:
820
  
Inhibitor
Name:
BDBM51895
Synonyms:
4-amyl-5,7-dimethoxy-8-[1-(4-methoxyphenyl)-3-(3-methylpiperidino)propyl]coumarin 5,7-dimethoxy-8-[1-(4-methoxyphenyl)-3-(3-methylpiperidin-1-yl)propyl]-4-pentyl-chromen-2-one MLS000879429 cid_16746298
Type:
Small organic molecule
Emp. Form.:
C32H43NO5
Mol. Mass.:
521.6875
SMILES:
CCCCCc1cc(=O)oc2c(C(CCN3CCCC(C)C3)c3ccc(OC)cc3)c(OC)cc(OC)c12
: