Target
Mitogen-activated protein kinase kinase kinase kinase 2
Ligand
BDBM32065
Substrate
Meas. Tech.
Dose Response Confirmation via Multiplex HTS Assay for Inhibitors of MEK Kinase PB1 Domains, specifically MEK5 binding to MEK Kinase 2 Wildtype
EC50
670±n/a nM
Citation
 PubChem, PC Dose Response Confirmation via Multiplex HTS Assay for Inhibitors of MEK Kinase PB1 Domains, specifically MEK5 binding to MEK Kinase 2 Wildtype PubChem Bioassay (2009)[AID] 
Target
Name:
Mitogen-activated protein kinase kinase kinase kinase 2
Synonyms:
2.7.11.1 GC kinase Germinal center kinase MAP4K2 MEK kinase kinase 2 RAB8IP | Rab8-interacting protein
Type:
Mol. Mass.:
91551.35
Organism:
Homo sapiens (Human)
Description:
Residue:
820
  
Inhibitor
Name:
BDBM32065
Synonyms:
2-[3-(2-furanylmethyl)-5-[[4-(N-methylanilino)phenyl]methylidene]-4-oxo-2-thiazolidinylidene]-4,4-dimethyl-3-oxopentanenitrile 2-[3-(furan-2-ylmethyl)-5-[[4-(N-methylanilino)phenyl]methylidene]-4-oxo-1,3-thiazolidin-2-ylidene]-4,4-dimethyl-3-oxopentanenitrile MLS000054217 cid_2998484
Type:
Small organic molecule
Emp. Form.:
C29H27N3O3S
Mol. Mass.:
497.608
SMILES:
CN(c1ccccc1)c1ccc(C=c2s\c(=C(\C#N)C(=O)C(C)(C)C)n(Cc3ccco3)c2=O)cc1
: