Target
Mitogen-activated protein kinase kinase kinase kinase 2
Ligand
BDBM51927
Substrate
Meas. Tech.
Dose Response Confirmation via Multiplex HTS Assay for Inhibitors of MEK Kinase PB1 Domains, specifically MEK5 binding to MEK Kinase 2 Wildtype
EC50
2850±n/a nM
Citation
 PubChem, PC Dose Response Confirmation via Multiplex HTS Assay for Inhibitors of MEK Kinase PB1 Domains, specifically MEK5 binding to MEK Kinase 2 Wildtype PubChem Bioassay (2009)[AID] 
Target
Name:
Mitogen-activated protein kinase kinase kinase kinase 2
Synonyms:
2.7.11.1 GC kinase Germinal center kinase MAP4K2 MEK kinase kinase 2 RAB8IP | Rab8-interacting protein
Type:
Mol. Mass.:
91551.35
Organism:
Homo sapiens (Human)
Description:
Residue:
820
  
Inhibitor
Name:
BDBM51927
Synonyms:
5-(3-bromanyl-4-methoxy-phenyl)-N-(4-ethylphenyl)-4-phenyl-1,3,4-thiadiazol-4-ium-2-amine;chloride MLS000948491 [5-(3-bromo-4-methoxy-phenyl)-4-phenyl-1,3,4-thiadiazol-4-ium-2-yl]-(4-ethylphenyl)amine;chloride | cid_24789743
Type:
Small organic molecule
Emp. Form.:
C23H21BrN3OS
Mol. Mass.:
467.401
SMILES:
CCc1ccc(Nc2n[n+](c(s2)-c2ccc(OC)c(Br)c2)-c2ccccc2)cc1
: