Target
Beta-lactamase
Ligand
BDBM51953
Substrate
Meas. Tech.
Epi-absorbance-based dose response biochemical high throughput screening assay for selective inhibitors of VIM-2 metallo-beta-lactamase
IC50
59640±n/a nM
Citation
 PubChem, PC Epi-absorbance-based dose response biochemical high throughput screening assay for selective inhibitors of VIM-2 metallo-beta-lactamase PubChem Bioassay (2009)[AID] 
Target
Name:
Beta-lactamase
Synonyms:
Beta lactamase
Type:
Enzyme Catalytic Domain
Mol. Mass.:
31513.38
Organism:
Pseudomonas aeruginosa
Description:
gi_114881106
Residue:
286
  
Inhibitor
Name:
BDBM51953
Synonyms:
4-(4-methoxyphenyl)-2-(4-methyl-1-piperazinyl)-6-(trifluoromethyl)pyrimidine 4-(4-methoxyphenyl)-2-(4-methylpiperazino)-6-(trifluoromethyl)pyrimidine SMR000022315 | cid_2985091
Type:
Small organic molecule
Emp. Form.:
C17H19F3N4O
Mol. Mass.:
352.3542
SMILES:
COc1ccc(cc1)-c1cc(nc(n1)N1CCN(C)CC1)C(F)(F)F
: