Target
Beta-lactamase
Ligand
BDBM51963
Substrate
Meas. Tech.
Epi-absorbance-based dose response biochemical high throughput screening assay for selective inhibitors of VIM-2 metallo-beta-lactamase
IC50
4991±n/a nM
Citation
 PubChem, PC Epi-absorbance-based dose response biochemical high throughput screening assay for selective inhibitors of VIM-2 metallo-beta-lactamase PubChem Bioassay (2009)[AID] 
Target
Name:
Beta-lactamase
Synonyms:
Beta lactamase
Type:
Enzyme Catalytic Domain
Mol. Mass.:
31513.38
Organism:
Pseudomonas aeruginosa
Description:
gi_114881106
Residue:
286
  
Inhibitor
Name:
BDBM51963
Synonyms:
MLS000557398 N-[5-[(2-fluorophenyl)methylsulfanylmethyl]-1,3,4-thiadiazol-2-yl]-2,2-dimethyl-propanamide N-[5-[[(2-fluorobenzyl)thio]methyl]-1,3,4-thiadiazol-2-yl]-2,2-dimethyl-propionamide SMR000148315 | cid_945654
Type:
Small organic molecule
Emp. Form.:
C15H18FN3OS2
Mol. Mass.:
339.451
SMILES:
CC(C)(C)C(=O)Nc1nnc(CSCc2ccccc2F)s1
: