Target
Beta-lactamase
Ligand
BDBM51688
Substrate
Meas. Tech.
Epi-absorbance-based dose response biochemical high throughput screening assay for selective inhibitors of VIM-2 metallo-beta-lactamase
IC50
6104±n/a nM
Citation
 PubChem, PC Epi-absorbance-based dose response biochemical high throughput screening assay for selective inhibitors of VIM-2 metallo-beta-lactamase PubChem Bioassay (2009)[AID] 
Target
Name:
Beta-lactamase
Synonyms:
Beta lactamase
Type:
Enzyme Catalytic Domain
Mol. Mass.:
31513.38
Organism:
Pseudomonas aeruginosa
Description:
gi_114881106
Residue:
286
  
Inhibitor
Name:
BDBM51688
Synonyms:
(3-Methyl-5-oxo-4,5-dihydro-1H-pyrazol-4-yl)-acetic acid [1-(2,5-dimethoxy-phenyl)-meth-(E)-ylidene]-hydrazide N-[(2,5-dimethoxybenzylidene)amino]-2-(3-keto-5-methyl-2-pyrazolin-4-yl)acetamide N-[(2,5-dimethoxyphenyl)methylideneamino]-2-(3-methyl-5-oxo-1,4-dihydropyrazol-4-yl)acetamide cid_3795446
Type:
Small organic molecule
Emp. Form.:
C15H18N4O4
Mol. Mass.:
318.3278
SMILES:
COc1ccc(OC)c(C=NNC(=O)Cc2c(C)[nH][nH]c2=O)c1
: