Target
Beta-lactamase
Ligand
BDBM52011
Substrate
Meas. Tech.
Epi-absorbance-based dose response biochemical high throughput screening assay for selective inhibitors of VIM-2 metallo-beta-lactamase
IC50
6691±n/a nM
Citation
 PubChem, PC Epi-absorbance-based dose response biochemical high throughput screening assay for selective inhibitors of VIM-2 metallo-beta-lactamase PubChem Bioassay (2009)[AID] 
Target
Name:
Beta-lactamase
Synonyms:
Beta lactamase
Type:
Enzyme Catalytic Domain
Mol. Mass.:
31513.38
Organism:
Pseudomonas aeruginosa
Description:
gi_114881106
Residue:
286
  
Inhibitor
Name:
BDBM52011
Synonyms:
4-cyclohexyl-3-(2-thienyl)-1H-1,2,4-triazole-5-thione 4-cyclohexyl-5-(2-thienyl)-2,4-dihydro-3H-1,2,4-triazole-3-thione SMR000459016 | cid_2816425
Type:
Small organic molecule
Emp. Form.:
C12H15N3S2
Mol. Mass.:
265.398
SMILES:
S=c1[nH]nc(-c2cccs2)n1C1CCCCC1
: