Target
Beta-lactamase
Ligand
BDBM52019
Substrate
Meas. Tech.
Epi-absorbance-based dose response biochemical high throughput screening assay for selective inhibitors of VIM-2 metallo-beta-lactamase
IC50
20003±n/a nM
Citation
 PubChem, PC Epi-absorbance-based dose response biochemical high throughput screening assay for selective inhibitors of VIM-2 metallo-beta-lactamase PubChem Bioassay (2009)[AID] 
Target
Name:
Beta-lactamase
Synonyms:
Beta lactamase
Type:
Enzyme Catalytic Domain
Mol. Mass.:
31513.38
Organism:
Pseudomonas aeruginosa
Description:
gi_114881106
Residue:
286
  
Inhibitor
Name:
BDBM52019
Synonyms:
3-(2-furanyl)-4-(2-methoxyphenyl)-1H-1,2,4-triazole-5-thione 3-(furan-2-yl)-4-(2-methoxyphenyl)-1H-1,2,4-triazole-5-thione SMR000543608 | cid_973894
Type:
Small organic molecule
Emp. Form.:
C13H11N3O2S
Mol. Mass.:
273.31
SMILES:
COc1ccccc1-n1c(n[nH]c1=S)-c1ccco1
: