Target
Beta-lactamase
Ligand
BDBM52030
Substrate
Meas. Tech.
Epi-absorbance-based dose response biochemical high throughput screening assay for selective inhibitors of VIM-2 metallo-beta-lactamase
IC50
35704±n/a nM
Citation
 PubChem, PC Epi-absorbance-based dose response biochemical high throughput screening assay for selective inhibitors of VIM-2 metallo-beta-lactamase PubChem Bioassay (2009)[AID] 
Target
Name:
Beta-lactamase
Synonyms:
Beta lactamase
Type:
Enzyme Catalytic Domain
Mol. Mass.:
31513.38
Organism:
Pseudomonas aeruginosa
Description:
gi_114881106
Residue:
286
  
Inhibitor
Name:
BDBM52030
Synonyms:
(2E)-2-(2-fluorobenzylidene)-3-keto-N-(3-morpholinopropyl)-4H-1,4-benzothiazine-6-carboxamide (2E)-2-[(2-fluorophenyl)methylidene]-N-(3-morpholin-4-ylpropyl)-3-oxo-4H-1,4-benzothiazine-6-carboxamide MLS001030664 cid_6010071
Type:
Small organic molecule
Emp. Form.:
C23H24FN3O3S
Mol. Mass.:
441.518
SMILES:
Fc1ccccc1\C=C1\Sc2ccc(cc2NC1=O)C(=O)NCCCN1CCOCC1
: