Target
Beta-lactamase
Ligand
BDBM51947
Substrate
Meas. Tech.
Epi-absorbance-based counterscreen for selective VIM-2 inhibitors: dose response biochemical high throughput screening assay to identify inhibitors of IMP-1 metallo-beta-lactamase.
IC50
59640±n/a nM
Citation
 PubChem, PC Epi-absorbance-based counterscreen for selective VIM-2 inhibitors: dose response biochemical high throughput screening assay to identify inhibitors of IMP-1 metallo-beta-lactamase. PubChem Bioassay (2009)[AID] 
Target
Name:
Beta-lactamase
Synonyms:
Beta-lactamase | metallo-beta-lactamase IMP-1
Type:
Enzyme Catalytic Domain
Mol. Mass.:
27125.88
Organism:
Pseudomonas aeruginosa
Description:
gi_27368096
Residue:
246
  
Inhibitor
Name:
BDBM51947
Synonyms:
(4E)-5-(2,5-dimethoxyphenyl)-1-(2-furanylmethyl)-4-[hydroxy-(4-methoxyphenyl)methylidene]pyrrolidine-2,3-dione (4E)-5-(2,5-dimethoxyphenyl)-1-(furan-2-ylmethyl)-4-[(4-methoxyphenyl)-oxidanyl-methylidene]pyrrolidine-2,3-dione MLS000077485 cid_5389282
Type:
Small organic molecule
Emp. Form.:
C25H23NO7
Mol. Mass.:
449.4526
SMILES:
COc1ccc(cc1)C(=O)C1C(N(Cc2ccco2)C(=O)C1=O)c1cc(OC)ccc1OC
: