Target
Beta-lactamase
Ligand
BDBM51997
Substrate
Meas. Tech.
Epi-absorbance-based counterscreen for selective VIM-2 inhibitors: dose response biochemical high throughput screening assay to identify inhibitors of IMP-1 metallo-beta-lactamase.
IC50
59640±n/a nM
Citation
 PubChem, PC Epi-absorbance-based counterscreen for selective VIM-2 inhibitors: dose response biochemical high throughput screening assay to identify inhibitors of IMP-1 metallo-beta-lactamase. PubChem Bioassay (2009)[AID] 
Target
Name:
Beta-lactamase
Synonyms:
Beta-lactamase | metallo-beta-lactamase IMP-1
Type:
Enzyme Catalytic Domain
Mol. Mass.:
27125.88
Organism:
Pseudomonas aeruginosa
Description:
gi_27368096
Residue:
246
  
Inhibitor
Name:
BDBM51997
Synonyms:
4-(2-furanylmethyl)-3-(2-methoxyphenyl)-1H-1,2,4-triazole-5-thione 4-(furan-2-ylmethyl)-3-(2-methoxyphenyl)-1H-1,2,4-triazole-5-thione SMR000384403 | cid_2398093
Type:
Small organic molecule
Emp. Form.:
C14H13N3O2S
Mol. Mass.:
287.337
SMILES:
COc1ccccc1-c1n[nH]c(=S)n1Cc1ccco1
: