Target
Beta-lactamase
Ligand
BDBM52008
Substrate
Meas. Tech.
Epi-absorbance-based counterscreen for selective VIM-2 inhibitors: dose response biochemical high throughput screening assay to identify inhibitors of IMP-1 metallo-beta-lactamase.
IC50
59640±n/a nM
Citation
 PubChem, PC Epi-absorbance-based counterscreen for selective VIM-2 inhibitors: dose response biochemical high throughput screening assay to identify inhibitors of IMP-1 metallo-beta-lactamase. PubChem Bioassay (2009)[AID] 
Target
Name:
Beta-lactamase
Synonyms:
Beta-lactamase | metallo-beta-lactamase IMP-1
Type:
Enzyme Catalytic Domain
Mol. Mass.:
27125.88
Organism:
Pseudomonas aeruginosa
Description:
gi_27368096
Residue:
246
  
Inhibitor
Name:
BDBM52008
Synonyms:
3-[2-[1,3-bis(oxidanylidene)isoindol-2-yl]ethyl]-5-chloranyl-1H-indole-2-carboxylic acid 5-chloro-3-(2-phthalimidoethyl)-1H-indole-2-carboxylic acid 5-chloro-3-[2-(1,3-dioxoisoindol-2-yl)ethyl]-1H-indole-2-carboxylic acid SMR000414879 | cid_1547995
Type:
Small organic molecule
Emp. Form.:
C19H13ClN2O4
Mol. Mass.:
368.771
SMILES:
OC(=O)c1[nH]c2ccc(Cl)cc2c1CCN1C(=O)c2ccccc2C1=O
: