Target
Beta-lactamase
Ligand
BDBM51950
Substrate
Meas. Tech.
FRET-based counterscreen for selective VIM-2 inhibitors: dose response biochemical high throughput screening assay to identify epi-absorbance assay artifacts.
IC50
59640±n/a nM
Citation
 PubChem, PC FRET-based counterscreen for selective VIM-2 inhibitors: dose response biochemical high throughput screening assay to identify epi-absorbance assay artifacts. PubChem Bioassay (2009)[AID] 
Target
Name:
Beta-lactamase
Synonyms:
Beta lactamase
Type:
Enzyme Catalytic Domain
Mol. Mass.:
31513.38
Organism:
Pseudomonas aeruginosa
Description:
gi_114881106
Residue:
286
  
Inhibitor
Name:
BDBM51950
Synonyms:
MLS000080251 cid_664602
Type:
Small organic molecule
Emp. Form.:
C14H8ClNO5S2
Mol. Mass.:
369.8
SMILES:
OC(=O)C1Sc2[nH]c(=O)sc2C2C1C(=O)Oc1ccc(Cl)cc21
: