Target
Beta-lactamase
Ligand
BDBM38499
Substrate
Meas. Tech.
FRET-based counterscreen for selective VIM-2 inhibitors: dose response biochemical high throughput screening assay to identify epi-absorbance assay artifacts.
IC50
4989±n/a nM
Citation
 PubChem, PC FRET-based counterscreen for selective VIM-2 inhibitors: dose response biochemical high throughput screening assay to identify epi-absorbance assay artifacts. PubChem Bioassay (2009)[AID] 
Target
Name:
Beta-lactamase
Synonyms:
Beta lactamase
Type:
Enzyme Catalytic Domain
Mol. Mass.:
31513.38
Organism:
Pseudomonas aeruginosa
Description:
gi_114881106
Residue:
286
  
Inhibitor
Name:
BDBM38499
Synonyms:
4-(1-cyclohex-2-enyl)-3-phenyl-1H-1,2,4-triazole-5-thione MLS000111390 cid_2906489
Type:
Small organic molecule
Emp. Form.:
C14H15N3S
Mol. Mass.:
257.354
SMILES:
S=c1[nH]nc(-c2ccccc2)n1C1CCCC=C1
: