Target
Beta-lactamase
Ligand
BDBM51993
Substrate
Meas. Tech.
FRET-based counterscreen for selective VIM-2 inhibitors: dose response biochemical high throughput screening assay to identify epi-absorbance assay artifacts.
IC50
2078±n/a nM
Citation
 PubChem, PC FRET-based counterscreen for selective VIM-2 inhibitors: dose response biochemical high throughput screening assay to identify epi-absorbance assay artifacts. PubChem Bioassay (2009)[AID] 
Target
Name:
Beta-lactamase
Synonyms:
Beta lactamase
Type:
Enzyme Catalytic Domain
Mol. Mass.:
31513.38
Organism:
Pseudomonas aeruginosa
Description:
gi_114881106
Residue:
286
  
Inhibitor
Name:
BDBM51993
Synonyms:
MLS001006653 N-[4-[(3-ethyl-5-sulfanylidene-1H-1,2,4-triazol-4-yl)iminomethyl]phenyl]ethanamide SMR000349615 | cid_2419700
Type:
Small organic molecule
Emp. Form.:
C13H15N5OS
Mol. Mass.:
289.356
SMILES:
CCc1n[nH]c(=S)n1N=Cc1ccc(NC(C)=O)cc1
: