Target
Beta-lactamase
Ligand
BDBM51995
Substrate
Meas. Tech.
FRET-based counterscreen for selective VIM-2 inhibitors: dose response biochemical high throughput screening assay to identify epi-absorbance assay artifacts.
IC50
889±n/a nM
Citation
 PubChem, PC FRET-based counterscreen for selective VIM-2 inhibitors: dose response biochemical high throughput screening assay to identify epi-absorbance assay artifacts. PubChem Bioassay (2009)[AID] 
Target
Name:
Beta-lactamase
Synonyms:
Beta lactamase
Type:
Enzyme Catalytic Domain
Mol. Mass.:
31513.38
Organism:
Pseudomonas aeruginosa
Description:
gi_114881106
Residue:
286
  
Inhibitor
Name:
BDBM51995
Synonyms:
4-(phenylmethyl)-3-thiophen-2-yl-1H-1,2,4-triazole-5-thione 4-benzyl-3-thiophen-2-yl-1H-1,2,4-triazole-5-thione SMR000349340 | cid_2383141
Type:
Small organic molecule
Emp. Form.:
C13H11N3S2
Mol. Mass.:
273.377
SMILES:
S=c1[nH]nc(-c2cccs2)n1Cc1ccccc1
: