Target
Beta-lactamase
Ligand
BDBM52014
Substrate
Meas. Tech.
FRET-based counterscreen for selective VIM-2 inhibitors: dose response biochemical high throughput screening assay to identify epi-absorbance assay artifacts.
IC50
332.29±n/a nM
Citation
 PubChem, PC FRET-based counterscreen for selective VIM-2 inhibitors: dose response biochemical high throughput screening assay to identify epi-absorbance assay artifacts. PubChem Bioassay (2009)[AID] 
Target
Name:
Beta-lactamase
Synonyms:
Beta lactamase
Type:
Enzyme Catalytic Domain
Mol. Mass.:
31513.38
Organism:
Pseudomonas aeruginosa
Description:
gi_114881106
Residue:
286
  
Inhibitor
Name:
BDBM52014
Synonyms:
3-ethyl-4-[[(Z)-2-methyl-3-phenyl-prop-2-enylidene]amino]-1H-1,2,4-triazole-5-thione 5-ethyl-4-[(2-methyl-3-phenyl-2-propen-1-ylidene)amino]-4H-1,2,4-triazole-3-thiol SMR000497460 | cid_1567820
Type:
Small organic molecule
Emp. Form.:
C14H16N4S
Mol. Mass.:
272.369
SMILES:
CCc1n[nH]c(=S)n1N=CC(C)=Cc1ccccc1
: