Target
Beta-lactamase
Ligand
BDBM51942
Substrate
Meas. Tech.
FRET-based counterscreen for selective VIM-2 inhibitors: dose response biochemical high throughput screening assay to identify inhibitors of IMP-1 metallo-beta-lactamase.
IC50
59640±n/a nM
Citation
 PubChem, PC FRET-based counterscreen for selective VIM-2 inhibitors: dose response biochemical high throughput screening assay to identify inhibitors of IMP-1 metallo-beta-lactamase. PubChem Bioassay (2009)[AID] 
Target
Name:
Beta-lactamase
Synonyms:
Beta-lactamase | metallo-beta-lactamase IMP-1
Type:
Enzyme Catalytic Domain
Mol. Mass.:
27125.88
Organism:
Pseudomonas aeruginosa
Description:
gi_27368096
Residue:
246
  
Inhibitor
Name:
BDBM51942
Synonyms:
MLS000029635 N-[2-[2-(diethylamino)-2-oxidanylidene-ethyl]sulfanyl-1,3-benzothiazol-6-yl]-2-(1-methylimidazol-2-yl)sulfanyl-ethanamide N-[2-[[2-(diethylamino)-2-keto-ethyl]thio]-1,3-benzothiazol-6-yl]-2-[(1-methylimidazol-2-yl)thio]acetamide SMR000011411 | cid_654026
Type:
Small organic molecule
Emp. Form.:
C19H23N5O2S3
Mol. Mass.:
449.613
SMILES:
CCN(CC)C(=O)CSc1nc2ccc(NC(=O)CSc3nccn3C)cc2s1
: