Target
Beta-lactamase
Ligand
BDBM51970
Substrate
Meas. Tech.
FRET-based counterscreen for selective VIM-2 inhibitors: dose response biochemical high throughput screening assay to identify inhibitors of IMP-1 metallo-beta-lactamase.
IC50
59640±n/a nM
Citation
 PubChem, PC FRET-based counterscreen for selective VIM-2 inhibitors: dose response biochemical high throughput screening assay to identify inhibitors of IMP-1 metallo-beta-lactamase. PubChem Bioassay (2009)[AID] 
Target
Name:
Beta-lactamase
Synonyms:
Beta-lactamase | metallo-beta-lactamase IMP-1
Type:
Enzyme Catalytic Domain
Mol. Mass.:
27125.88
Organism:
Pseudomonas aeruginosa
Description:
gi_27368096
Residue:
246
  
Inhibitor
Name:
BDBM51970
Synonyms:
(3-Methyl-5-oxo-4,5-dihydro-1H-pyrazol-4-yl)-acetic acid [1-(2,4,5-trimethoxy-phenyl)-meth-(E)-ylidene]-hydrazide 2-(3-methyl-5-oxidanylidene-1,4-dihydropyrazol-4-yl)-N-[(2,4,5-trimethoxyphenyl)methylideneamino]ethanamide MLS000555854 cid_3749096
Type:
Small organic molecule
Emp. Form.:
C16H20N4O5
Mol. Mass.:
348.3538
SMILES:
COc1cc(OC)c(C=NNC(=O)Cc2c(C)[nH][nH]c2=O)cc1OC
: