Target
Beta-lactamase
Ligand
BDBM51989
Substrate
Meas. Tech.
FRET-based counterscreen for selective VIM-2 inhibitors: dose response biochemical high throughput screening assay to identify inhibitors of IMP-1 metallo-beta-lactamase.
IC50
59640±n/a nM
Citation
 PubChem, PC FRET-based counterscreen for selective VIM-2 inhibitors: dose response biochemical high throughput screening assay to identify inhibitors of IMP-1 metallo-beta-lactamase. PubChem Bioassay (2009)[AID] 
Target
Name:
Beta-lactamase
Synonyms:
Beta-lactamase | metallo-beta-lactamase IMP-1
Type:
Enzyme Catalytic Domain
Mol. Mass.:
27125.88
Organism:
Pseudomonas aeruginosa
Description:
gi_27368096
Residue:
246
  
Inhibitor
Name:
BDBM51989
Synonyms:
3-[3-(2,4-dichlorobenzyl)oxy-2-thienyl]-4-methyl-1H-1,2,4-triazole-5-thione 3-[3-[(2,4-dichlorophenyl)methoxy]thiophen-2-yl]-4-methyl-1H-1,2,4-triazole-5-thione MLS000692151 cid_1482500
Type:
Small organic molecule
Emp. Form.:
C14H11Cl2N3OS2
Mol. Mass.:
372.293
SMILES:
Cn1c(n[nH]c1=S)-c1sccc1OCc1ccc(Cl)cc1Cl
: