Target
Beta-lactamase
Ligand
BDBM51999
Substrate
Meas. Tech.
FRET-based counterscreen for selective VIM-2 inhibitors: dose response biochemical high throughput screening assay to identify inhibitors of IMP-1 metallo-beta-lactamase.
IC50
59640±n/a nM
Citation
 PubChem, PC FRET-based counterscreen for selective VIM-2 inhibitors: dose response biochemical high throughput screening assay to identify inhibitors of IMP-1 metallo-beta-lactamase. PubChem Bioassay (2009)[AID] 
Target
Name:
Beta-lactamase
Synonyms:
Beta-lactamase | metallo-beta-lactamase IMP-1
Type:
Enzyme Catalytic Domain
Mol. Mass.:
27125.88
Organism:
Pseudomonas aeruginosa
Description:
gi_27368096
Residue:
246
  
Inhibitor
Name:
BDBM51999
Synonyms:
3-cyclopropyl-4-(phenylmethyl)-1H-1,2,4-triazole-5-thione MLS001005972 cid_2478591
Type:
Small organic molecule
Emp. Form.:
C12H13N3S
Mol. Mass.:
231.317
SMILES:
S=c1[nH]nc(C2CC2)n1Cc1ccccc1
: