Target
Beta-lactamase
Ligand
BDBM52041
Substrate
Meas. Tech.
FRET-based counterscreen for selective VIM-2 inhibitors: dose response biochemical high throughput screening assay to identify inhibitors of IMP-1 metallo-beta-lactamase.
IC50
59640±n/a nM
Citation
 PubChem, PC FRET-based counterscreen for selective VIM-2 inhibitors: dose response biochemical high throughput screening assay to identify inhibitors of IMP-1 metallo-beta-lactamase. PubChem Bioassay (2009)[AID] 
Target
Name:
Beta-lactamase
Synonyms:
Beta-lactamase | metallo-beta-lactamase IMP-1
Type:
Enzyme Catalytic Domain
Mol. Mass.:
27125.88
Organism:
Pseudomonas aeruginosa
Description:
gi_27368096
Residue:
246
  
Inhibitor
Name:
BDBM52041
Synonyms:
(2R)-1-[2-[(4-keto-6-methyl-2,3-dihydro-1H-cyclopenta[c]chromen-7-yl)oxy]acetyl]proline (2R)-1-[2-[(6-methyl-4-oxo-2,3-dihydro-1H-cyclopenta[c][1]benzopyran-7-yl)oxy]-1-oxoethyl]-2-pyrrolidinecarboxylic acid MLS001139443 cid_6569799
Type:
Small organic molecule
Emp. Form.:
C20H21NO6
Mol. Mass.:
371.3838
SMILES:
Cc1c(OCC(=O)N2CCC[C@@H]2C(O)=O)ccc2c3CCCc3c(=O)oc12
: