Target
Beta-lactamase
Ligand
BDBM52046
Substrate
Meas. Tech.
FRET-based counterscreen for selective VIM-2 inhibitors: dose response biochemical high throughput screening assay to identify inhibitors of IMP-1 metallo-beta-lactamase.
IC50
59640±n/a nM
Citation
 PubChem, PC FRET-based counterscreen for selective VIM-2 inhibitors: dose response biochemical high throughput screening assay to identify inhibitors of IMP-1 metallo-beta-lactamase. PubChem Bioassay (2009)[AID] 
Target
Name:
Beta-lactamase
Synonyms:
Beta-lactamase | metallo-beta-lactamase IMP-1
Type:
Enzyme Catalytic Domain
Mol. Mass.:
27125.88
Organism:
Pseudomonas aeruginosa
Description:
gi_27368096
Residue:
246
  
Inhibitor
Name:
BDBM52046
Synonyms:
MLS001237880 N-[5-[2-[(2-chlorophenyl)methylamino]-2-oxoethyl]sulfanyl-1,3,4-thiadiazol-2-yl]cyclopropanecarboxamide N-[5-[[2-[(2-chlorophenyl)methylamino]-2-oxoethyl]thio]-1,3,4-thiadiazol-2-yl]cyclopropanecarboxamide cid_8483299
Type:
Small organic molecule
Emp. Form.:
C15H15ClN4O2S2
Mol. Mass.:
382.888
SMILES:
Clc1ccccc1CNC(=O)CSc1nnc(NC(=O)C2CC2)s1
: