Target
Zinc finger protein mex-5
Ligand
BDBM52075
Substrate
Meas. Tech.
Fluorescent Polarization Homogeneous Dose Response HTS to Indentify Inhibitors of Mex-5 Binding to TCR-2
EC50
87578±n/a nM
Citation
 PubChem, PC Fluorescent Polarization Homogeneous Dose Response HTS to Indentify Inhibitors of Mex-5 Binding to TCR-2 PubChem Bioassay (2009)[AID] 
Target
Name:
Zinc finger protein mex-5
Synonyms:
MEX5_CAEEL mex-5
Type:
Enzyme Catalytic Domain
Mol. Mass.:
52832.78
Organism:
Caenorhabditis elegans
Description:
gi_55976631
Residue:
468
  
Inhibitor
Name:
BDBM52075
Synonyms:
1,3-dimethyl-5-(3-methylphenyl)pyrimido[1,2]pyrrolo[4,5-b]pyridazine-2,4-dione 5,7-Dimethyl-9-m-tolyl-5H-1,5,7,9a-tetraaza-fluorene-6,8-dione SMR000014110 | cid_651577
Type:
Small organic molecule
Emp. Form.:
C18H16N4O2
Mol. Mass.:
320.3452
SMILES:
Cc1cccc(c1)-c1c2c(n(C)c(=O)n(C)c2=O)c2cccnn12
: