Target
Zinc finger protein mex-5
Ligand
BDBM50856
Substrate
Meas. Tech.
Fluorescent Polarization Homogeneous Dose Response HTS to Indentify Inhibitors of Mex-5 Binding to TCR-2
EC50
9859±n/a nM
Citation
 PubChem, PC Fluorescent Polarization Homogeneous Dose Response HTS to Indentify Inhibitors of Mex-5 Binding to TCR-2 PubChem Bioassay (2009)[AID] 
Target
Name:
Zinc finger protein mex-5
Synonyms:
MEX5_CAEEL mex-5
Type:
Enzyme Catalytic Domain
Mol. Mass.:
52832.78
Organism:
Caenorhabditis elegans
Description:
gi_55976631
Residue:
468
  
Inhibitor
Name:
BDBM50856
Synonyms:
MLS000548971 N-methyl-N-[(1,3,5-trimethyl-4-pyrazolyl)methyl]-9H-xanthene-9-carboxamide SMR000114842 | cid_1223828
Type:
Small organic molecule
Emp. Form.:
C22H23N3O2
Mol. Mass.:
361.4369
SMILES:
CN(Cc1c(C)nn(C)c1C)C(=O)C1c2ccccc2Oc2ccccc12
: