Target
Zinc finger protein mex-5
Ligand
BDBM52249
Substrate
Meas. Tech.
Fluorescent Polarization Homogeneous Dose Response HTS to Indentify Inhibitors of Mex-5 Binding to TCR-2
EC50
300000±n/a nM
Citation
 PubChem, PC Fluorescent Polarization Homogeneous Dose Response HTS to Indentify Inhibitors of Mex-5 Binding to TCR-2 PubChem Bioassay (2009)[AID] 
Target
Name:
Zinc finger protein mex-5
Synonyms:
MEX5_CAEEL mex-5
Type:
Enzyme Catalytic Domain
Mol. Mass.:
52832.78
Organism:
Caenorhabditis elegans
Description:
gi_55976631
Residue:
468
  
Inhibitor
Name:
BDBM52249
Synonyms:
(5E)-1-benzyl-5-[[4-(diethylamino)anilino]methylene]barbituric acid (5E)-5-[[4-(diethylamino)anilino]methylidene]-1-(phenylmethyl)-1,3-diazinane-2,4,6-trione (5Z)-1-benzyl-5-[[4-(diethylamino)anilino]methylene]barbituric acid MLS000555566 cid_5520426
Type:
Small organic molecule
Emp. Form.:
C22H24N4O3
Mol. Mass.:
392.451
SMILES:
CCN(CC)c1ccc(NC=C2C(=O)NC(=O)N(Cc3ccccc3)C2=O)cc1
: