Target
Zinc finger protein mex-5
Ligand
BDBM48030
Substrate
Meas. Tech.
Fluorescent Polarization Homogeneous Dose Response HTS to Indentify Inhibitors of Mex-5 Binding to TCR-2
EC50
60792±n/a nM
Citation
 PubChem, PC Fluorescent Polarization Homogeneous Dose Response HTS to Indentify Inhibitors of Mex-5 Binding to TCR-2 PubChem Bioassay (2009)[AID] 
Target
Name:
Zinc finger protein mex-5
Synonyms:
MEX5_CAEEL mex-5
Type:
Enzyme Catalytic Domain
Mol. Mass.:
52832.78
Organism:
Caenorhabditis elegans
Description:
gi_55976631
Residue:
468
  
Inhibitor
Name:
BDBM48030
Synonyms:
4-[(E)-[3-(2-fluoroanilino)-4-keto-1-naphthylidene]amino]sulfonylbenzoic acid 4-[(E)-[3-(2-fluoroanilino)-4-oxonaphthalen-1-ylidene]amino]sulfonylbenzoic acid MLS000948172 cid_6023694
Type:
Small organic molecule
Emp. Form.:
C23H15FN2O5S
Mol. Mass.:
450.439
SMILES:
OC(=O)c1ccc(cc1)S(=O)(=O)N=C1C=C(Nc2ccccc2F)C(=O)c2ccccc12
: