Target
POsterior Segregation
Ligand
BDBM53364
Substrate
Meas. Tech.
Fluorescent Polarization Homogeneous Dose Response HTS to Indentify Inhibitors of POS-1 Binding to mex-3-RNA
EC50
300000±n/a nM
Citation
 PubChem, PC Fluorescent Polarization Homogeneous Dose Response HTS to Indentify Inhibitors of POS-1 Binding to mex-3-RNA PubChem Bioassay (2009)[AID] 
Target
Name:
POsterior Segregation
Synonyms:
POsterior Segregation family member (pos-1)
Type:
Enzyme Catalytic Domain
Mol. Mass.:
29838.90
Organism:
Caenorhabditis elegans
Description:
gi_17562800
Residue:
264
  
Inhibitor
Name:
BDBM53364
Synonyms:
(5Z)-5-(3-ethoxy-4-propoxybenzylidene)-2-(2-furyl)[1,3]thiazolo[3,2-b][1,2,4]triazol-6(5H)-one 5-[(3-ethoxy-4-propoxy-phenyl)methylidene]-2-(furan-2-yl)-[1,3]thiazolo[3,2-b][1,2,4]triazol-6-one 5-[(3-ethoxy-4-propoxyphenyl)methylidene]-2-(furan-2-yl)-[1,3]thiazolo[3,2-b][1,2,4]triazol-6-one SMR000020579 | cid_3241100
Type:
Small organic molecule
Emp. Form.:
C20H19N3O4S
Mol. Mass.:
397.448
SMILES:
CCCOc1ccc(C=c2sc3nc(nn3c2=O)-c2ccco2)cc1OCC
: