Target
POsterior Segregation
Ligand
BDBM53382
Substrate
Meas. Tech.
Fluorescent Polarization Homogeneous Dose Response HTS to Indentify Inhibitors of POS-1 Binding to mex-3-RNA
EC50
54142±n/a nM
Citation
 PubChem, PC Fluorescent Polarization Homogeneous Dose Response HTS to Indentify Inhibitors of POS-1 Binding to mex-3-RNA PubChem Bioassay (2009)[AID] 
Target
Name:
POsterior Segregation
Synonyms:
POsterior Segregation family member (pos-1)
Type:
Enzyme Catalytic Domain
Mol. Mass.:
29838.90
Organism:
Caenorhabditis elegans
Description:
gi_17562800
Residue:
264
  
Inhibitor
Name:
BDBM53382
Synonyms:
(2E,4S,5S,6S,12aS)-2-[amino(hydroxy)methylene]-4-(dimethylamino)-5,6,10,11,12a-pentahydroxy-6-methyl-4,4a,5,5a-tetrahydrotetracene-1,3,12-trione;hydrochloride (2E,4S,5S,6S,12aS)-2-[azanyl(oxidanyl)methylidene]-4-(dimethylamino)-6-methyl-5,6,10,11,12a-pentakis(oxidanyl)-4,4a,5,5a-tetrahydrotetracene-1,3,12-trione;hydrochloride MLS001335873 SMR000875333 | cid_24981353
Type:
Small organic molecule
Emp. Form.:
C22H24N2O9
Mol. Mass.:
460.434
SMILES:
CN(C)[C@H]1C2C(O)C3C(C(=O)c4c(O)cccc4[C@@]3(C)O)C(=O)[C@]2(O)C(=O)C(C(N)=O)C1=O
: