Target
POsterior Segregation
Ligand
BDBM44482
Substrate
Meas. Tech.
Fluorescent Polarization Homogeneous Dose Response HTS to Indentify Inhibitors of POS-1 Binding to mex-3-RNA
EC50
11021±n/a nM
Citation
 PubChem, PC Fluorescent Polarization Homogeneous Dose Response HTS to Indentify Inhibitors of POS-1 Binding to mex-3-RNA PubChem Bioassay (2009)[AID] 
Target
Name:
POsterior Segregation
Synonyms:
POsterior Segregation family member (pos-1)
Type:
Enzyme Catalytic Domain
Mol. Mass.:
29838.90
Organism:
Caenorhabditis elegans
Description:
gi_17562800
Residue:
264
  
Inhibitor
Name:
BDBM44482
Synonyms:
2-[(5Z)-5-[(E)-3-(2-furanyl)prop-2-enylidene]-4-oxo-2-sulfanylidene-3-thiazolidinyl]-3-methylbutanoic acid 2-[(5Z)-5-[(E)-3-(furan-2-yl)prop-2-enylidene]-4-oxidanylidene-2-sulfanylidene-1,3-thiazolidin-3-yl]-3-methyl-butanoic acid 2-{5-[(E)-3-Furan-2-yl-prop-2-en-(Z)-ylidene]-4-oxo-2-thioxo-thiazolidin-3-yl}-3-methyl-butyric acid SMR000145597 | cid_6393068
Type:
Small organic molecule
Emp. Form.:
C15H15NO4S2
Mol. Mass.:
337.414
SMILES:
CC(C)C(N1C(=S)S\C(=C/C=C/c2ccco2)C1=O)C(O)=O
: