Target
Dual specificity protein phosphatase 6
Ligand
BDBM34170
Substrate
Meas. Tech.
MKP-3 in vitro HTS assay
IC50
10000±n/a nM
Citation
 PubChem, PC MKP-3 in vitro HTS assay PubChem Bioassay (2009)[AID] 
Target
Name:
Dual specificity protein phosphatase 6
Synonyms:
DUS6_RAT MAP kinase phosphatase 3 Mitogen-activated protein kinase phosphatase 3 | Mkp3
Type:
Enzyme
Mol. Mass.:
42303.19
Organism:
Rattus norvegicus
Description:
gi_16758752
Residue:
381
  
Inhibitor
Name:
BDBM34170
Synonyms:
2-[(2-ethyl-1-keto-7,8-dihydro-6H-cyclopenta[2,3]thieno[2,4-b]pyrimidin-3-yl)thio]acetic acid 2-[(2-ethyl-1-oxo-7,8-dihydro-6H-cyclopenta[2,3]thieno[2,4-b]pyrimidin-3-yl)sulfanyl]acetic acid MLS000069140 cid_658077
Type:
Small organic molecule
Emp. Form.:
C13H14N2O3S2
Mol. Mass.:
310.392
SMILES:
CCn1c(SCC(O)=O)nc2sc3CCCc3c2c1=O
: