Target
Dual specificity protein phosphatase 6
Ligand
BDBM35435
Substrate
Meas. Tech.
MKP-3 in vitro HTS assay
IC50
100000±n/a nM
Citation
 PubChem, PC MKP-3 in vitro HTS assay PubChem Bioassay (2009)[AID] 
Target
Name:
Dual specificity protein phosphatase 6
Synonyms:
DUS6_RAT MAP kinase phosphatase 3 Mitogen-activated protein kinase phosphatase 3 | Mkp3
Type:
Enzyme
Mol. Mass.:
42303.19
Organism:
Rattus norvegicus
Description:
gi_16758752
Residue:
381
  
Inhibitor
Name:
BDBM35435
Synonyms:
6-hydroxy-4-phenyl-3,4-dihydro-2H-1-benzopyran-2-one 6-hydroxy-4-phenyl-chroman-2-one MLS000107029 cid_3871907
Type:
Small organic molecule
Emp. Form.:
C15H12O3
Mol. Mass.:
240.254
SMILES:
Oc1ccc2OC(=O)CC(c3ccccc3)c2c1
: