Target
Dual specificity protein phosphatase 6
Ligand
BDBM51271
Substrate
Meas. Tech.
MKP-3 in vitro HTS assay
IC50
96500±n/a nM
Citation
 PubChem, PC MKP-3 in vitro HTS assay PubChem Bioassay (2009)[AID] 
Target
Name:
Dual specificity protein phosphatase 6
Synonyms:
DUS6_RAT MAP kinase phosphatase 3 Mitogen-activated protein kinase phosphatase 3 | Mkp3
Type:
Enzyme
Mol. Mass.:
42303.19
Organism:
Rattus norvegicus
Description:
gi_16758752
Residue:
381
  
Inhibitor
Name:
BDBM51271
Synonyms:
(9-Methylsulfanyl-4-phenyl-2,3-dihydro-1H-6-thia-5,8,10-triaza-cyclopenta[c]fluoren-7-ylsulfanyl)-acetic acid SMR000415473 cid_2027019
Type:
Small organic molecule
Emp. Form.:
C21H17N3O2S3
Mol. Mass.:
439.574
SMILES:
CSc1nc(SCC(O)=O)c2sc3nc(c4CCCc4c3c2n1)-c1ccccc1
: