Target
Dual specificity protein phosphatase 6
Ligand
BDBM51783
Substrate
Meas. Tech.
MKP-3 in vitro HTS assay
IC50
30900±n/a nM
Citation
 PubChem, PC MKP-3 in vitro HTS assay PubChem Bioassay (2009)[AID] 
Target
Name:
Dual specificity protein phosphatase 6
Synonyms:
DUS6_RAT MAP kinase phosphatase 3 Mitogen-activated protein kinase phosphatase 3 | Mkp3
Type:
Enzyme
Mol. Mass.:
42303.19
Organism:
Rattus norvegicus
Description:
gi_16758752
Residue:
381
  
Inhibitor
Name:
BDBM51783
Synonyms:
3-[(5E)-5-[1-(2-chlorobenzyl)-2-keto-indolin-3-ylidene]-4-keto-2-thioxo-thiazolidin-3-yl]propionic acid 3-[(5E)-5-[1-[(2-chlorophenyl)methyl]-2-oxo-3-indolylidene]-4-oxo-2-sulfanylidene-3-thiazolidinyl]propanoic acid MLS001173336 cid_1570081
Type:
Small organic molecule
Emp. Form.:
C21H15ClN2O4S2
Mol. Mass.:
458.938
SMILES:
OC(=O)CCN1C(=S)S\C(C1=O)=C1\C(=O)N(Cc2ccccc2Cl)c2ccccc12
: