Target
Tyrosine-protein phosphatase non-receptor type 7
Ligand
BDBM29615
Substrate
Meas. Tech.
HTS Discovery of Chemical Inhibitors of HePTP, a Leukemia Target
IC50
1280±n/a nM
Citation
 PubChem, PC HTS Discovery of Chemical Inhibitors of HePTP, a Leukemia Target PubChem Bioassay (2008)[AID] 
Target
Name:
Tyrosine-protein phosphatase non-receptor type 7
Synonyms:
He-PTP Hematopoietic protein-tyrosine phosphatase (HEPTP) PTPN7 Tyrosine-protein phosphatase non-receptor type 7 | Tyrosine-protein phosphatase non-receptor type 7 (HEPTP)
Type:
Protein
Mol. Mass.:
40530.79
Organism:
Homo sapiens (Human)
Description:
P35236
Residue:
360
  
Inhibitor
Name:
BDBM29615
Synonyms:
6-methoxy-3a,4,5,9b-tetrahydro-3H-cyclopenta[c]quinoline-4-carboxylic acid SMR000009698 cid_652912
Type:
Small organic molecule
Emp. Form.:
C14H15NO3
Mol. Mass.:
245.2738
SMILES:
COc1cccc2C3C=CCC3C(Nc12)C(O)=O
: