Target
Tyrosine-protein phosphatase non-receptor type 7
Ligand
BDBM40576
Substrate
Meas. Tech.
HTS Discovery of Chemical Inhibitors of HePTP, a Leukemia Target
IC50
420±n/a nM
Citation
 PubChem, PC HTS Discovery of Chemical Inhibitors of HePTP, a Leukemia Target PubChem Bioassay (2008)[AID] 
Target
Name:
Tyrosine-protein phosphatase non-receptor type 7
Synonyms:
He-PTP Hematopoietic protein-tyrosine phosphatase (HEPTP) PTPN7 Tyrosine-protein phosphatase non-receptor type 7 | Tyrosine-protein phosphatase non-receptor type 7 (HEPTP)
Type:
Protein
Mol. Mass.:
40530.79
Organism:
Homo sapiens (Human)
Description:
P35236
Residue:
360
  
Inhibitor
Name:
BDBM40576
Synonyms:
2-(2,5-Dimethyl-pyrrol-1-yl)-3-phenyl-propionic acid 2-(2,5-dimethylpyrrol-1-yl)-3-phenyl-propanoic acid 2-(2,5-dimethylpyrrol-1-yl)-3-phenylpropanoic acid SMR000010168 | cid_654761
Type:
Small organic molecule
Emp. Form.:
C15H17NO2
Mol. Mass.:
243.301
SMILES:
Cc1ccc(C)n1C(Cc1ccccc1)C(O)=O
: